BDBM168437 US9675593, 10
SMILES CC(C)Oc1ccc(cc1)-n1cc(ccc1=O)C(C)=O
InChI Key InChIKey=VAQFZAZXECLTBU-UHFFFAOYSA-N
Data  1 EC50
  Tab Delimited (TSV)   2D SDfile   Computed 3D by Vconf -m prep SDfile
Find this compound or compounds like it in BindingDB:
Activity Spreadsheet -- Enzyme Inhibition Constant Data from BindingDB
Found 1 hit for monomerid = 168437
TargetEndothelin-1(Homo sapiens (Human))
SRMLSC
US Patent
LigandPNGBDBM168437(US9675593, 10)
Affinity DataEC50: >2.00E+5nM. Assay description: Fibroblasts (primary human lung and dermal, HFL-1, 3T3 etc) are seeded in 96-well plates at ~15000 cells/well and serum starved for 0-48 hours. After...
Ligand InfoPC cidPC sid
In DepthDetails US Patent