BDBM168626 US9079852, Table F, Compound 11
SMILES O[C@H](COc1ccc2NC(=O)CCc2c1)CN1CCN(CC1)c1ccc(Cl)cc1
InChI Key InChIKey=FFJJKTNCSJWBOG-IBGZPJMESA-N
Data  1 KI  1 IC50
  Tab Delimited (TSV)   2D SDfile   Computed 3D by Vconf -m prep SDfile
Find this compound or compounds like it in BindingDB:
Activity Spreadsheet -- Enzyme Inhibition Constant Data from BindingDB
Found 2 hits for monomerid = 168626
TargetPotassium voltage-gated channel subfamily H member 2(Homo sapiens (Human))
Emory University
US Patent
LigandPNGBDBM168626(US9079852, Table F, Compound 11)
Affinity DataKi:  5.00E+3nM. Assay description: Compounds were evaluated for binding to the human ether-a-go-go potassium channel (hERG) expressed in HEK293 cells by displacement of 3[H]-astemizole...
Ligand InfoPC cidPC sid
In DepthDetails US Patent
TargetAlpha-1A/Alpha-1B/Alpha-1D adrenergic receptor(Rattus norvegicus (rat))
Emory University
US Patent
LigandPNGBDBM168626(US9079852, Table F, Compound 11)
Affinity DataIC50:  100nM. Assay description: Binding to the rat alpha-1 adrenergic receptor in rat brain membranes was determined by displacement of 3[H]-prazosin (P. Greengrass and R. Bremner; ...
Ligand InfoPC cidPC sid
In DepthDetails US Patent