BDBM170519 US9669034, 93 (rac)-4-[4-Fluoro-2-(1,2-oxazol-3-ylmethoxy)phenyl]-N-{3-[(S-methylsulfonimidoyl)methyl]phenyl}-1,3,5-triazin-2-amine
SMILES CS(=N)(=O)Cc1cccc(Nc2ncnc(n2)-c2ccc(F)cc2OCc2ccon2)c1
InChI Key InChIKey=AXLURCFSKIWPCA-UHFFFAOYSA-N
Data  2 IC50
  Tab Delimited (TSV)   2D SDfile   Computed 3D by Vconf -m prep SDfile
Find this compound or compounds like it in BindingDB:
Activity Spreadsheet -- Enzyme Inhibition Constant Data from BindingDB
Found 2 hits for monomerid = 170519
TargetCyclin-dependent kinase 2/G1/S-specific cyclin-E1(Homo sapiens (Human))
Bayer Intellectual Property
US Patent
LigandPNGBDBM170519(US9669034, 93 (rac)-4-[4-Fluoro-2-(1,2-oxazol-3-yl...)
Affinity DataIC50:  2.00E+3nMpH: 8.0 T: 2°C. Assay description: For the assay 50 nl of a 100 fold concentrated solution of the test compound in DMSO was pipetted into a black low volume 384 well microtiter plate (...
Ligand InfoPC cidPC sid
In DepthDetails US Patent
TargetCyclin-T1/Cyclin-dependent kinase 9(Homo sapiens (Human))
Bayer Intellectual Property
US Patent
LigandPNGBDBM170519(US9669034, 93 (rac)-4-[4-Fluoro-2-(1,2-oxazol-3-yl...)
Affinity DataIC50:  7nMpH: 8.0 T: 2°C. Assay description: For the assay 50 nl of a 100 fold concentrated solution of the test compound in DMSO was pipetted into a black low volume 384 well microtiter plate (...
Ligand InfoPC cidPC sid
In DepthDetails US Patent