BDBM171581 US9085576, 215::US9611261, Example 215
SMILES CC#CCOc1cnc(cn1)C(=O)Nc1ccc(Cl)c(c1)[C@]1(N=C(N)O[C@@H]2C[C@H]12)C(F)F
InChI Key InChIKey=JLKYLAHXHDAGED-CQURBHOASA-N
Data  4 IC50
  Tab Delimited (TSV)   2D SDfile   Computed 3D by Vconf -m prep SDfile
Find this compound or compounds like it in BindingDB:
Activity Spreadsheet -- Enzyme Inhibition Constant Data from BindingDB
Found 4 hits for monomerid = 171581
TargetBeta-secretase 1(Homo sapiens (Human))
Amgen
US Patent
LigandPNGBDBM171581(US9085576, 215 | US9611261, Example 215)
Affinity DataIC50:  1.70nMpH: 4.2Assay Description:The assay buffer used in this screen is 0.05 M acetate, pH 4.2, 10% DMSO final, 100 uM genapol (which is a nonionic detergent, below its Critical Mic...
In DepthDetails US Patent
TargetCathepsin D(Homo sapiens (Human))
Amgen
US Patent
LigandPNGBDBM171581(US9085576, 215 | US9611261, Example 215)
Affinity DataIC50:  1.93E+6nM. Assay description: Recombinant Cat D was expressed in CHO cells. The assay buffer for CathepsinD is 0.05 M citrate pH 3.5, 10% DMSO final, 5 mM CHAPS. The Cat D enzyme ...
In DepthDetails US Patent
TargetBeta-secretase 1(Homo sapiens (Human))
Amgen
US Patent
LigandPNGBDBM171581(US9085576, 215 | US9611261, Example 215)
Affinity DataIC50:  1.70nM. Assay description: The assay buffer used in this screen is 0.05 M acetate, pH 4.2, 10% DMSO final, 100 uM genapol (which is a nonionic detergent, below its Critical Mic...
In DepthDetails US Patent
TargetCathepsin D(Homo sapiens (Human))
Amgen
US Patent
LigandPNGBDBM171581(US9085576, 215 | US9611261, Example 215)
Affinity DataIC50:  1.93E+6nMpH: 3.5Assay Description:Recombinant Cat D was expressed in CHO cells. The assay buffer for CathepsinD is 0.05 M citrate pH 3.5, 10% DMSO final, 5 mM CHAPS. The Cat D enzyme ...
In DepthDetails US Patent