BDBM173676 US9102591, (+)2-chloro-N-[3-cyclopropyl-2-[6-(trifluoromethyl)-3-pyridyl]propyl]benzamide::US9102591, (-)2-chloro-N-[3-cyclopropyl-2-[6-(trifluoromethyl)-3-pyridyl]propyl]benzamide::US9102591, 2-chloro-N-[3-cyclopropyl-2-[6-(trifluoromethyl)-3-pyridyl]propyl]benzamide::US9649308, (-)2-chloro-N-[3-cyclopropyl-2-[6-(trifluoromethyl)-3-pyridyl]propyl]benzamide
SMILES FC(F)(F)c1ccc(cn1)C(CNC(=O)c1ccccc1Cl)CC1CC1
InChI Key InChIKey=KHWQIZKQWLPKRO-UHFFFAOYSA-N
Data  6 IC50
  Tab Delimited (TSV)   2D SDfile   Computed 3D by Vconf -m prep SDfile
Find this compound or compounds like it in BindingDB:
Activity Spreadsheet -- Enzyme Inhibition Constant Data from BindingDB
Found 6 hits for monomerid = 173676
TargetP2X purinoceptor 7(Homo sapiens (Human))
H. Lundbeck
US Patent
LigandPNGBDBM173676(US9102591, (+)2-chloro-N-[3-cyclopropyl-2-[6-(trif...)
Affinity DataIC50:  3.40nMpH: 7.4 T: 2°C. Assay description: Fluorescent Imaging Plate Reader (FLIPR) assay: Briefly, 293-human or mouse P2X7 stable cells were incubated in sucrose buffer, pH 7.4 [KCl (5 mM), N...
In DepthDetails US Patent
TargetP2X purinoceptor 7(Homo sapiens (Human))
H. Lundbeck
US Patent
LigandPNGBDBM173676(US9102591, (+)2-chloro-N-[3-cyclopropyl-2-[6-(trif...)
Affinity DataIC50:  63nMpH: 7.4 T: 2°C. Assay description: Fluorescent Imaging Plate Reader (FLIPR) assay: Briefly, 293-human or mouse P2X7 stable cells were incubated in sucrose buffer, pH 7.4 [KCl (5 mM), N...
In DepthDetails US Patent
TargetP2X purinoceptor 7(Homo sapiens (Human))
H. Lundbeck
US Patent
LigandPNGBDBM173676(US9102591, (+)2-chloro-N-[3-cyclopropyl-2-[6-(trif...)
Affinity DataIC50:  3.40nM. Assay description: Fluorescent Imaging Plate Reader (FLIPR) assay: Briefly, 293-human or mouse P2X7 stable cells were incubated in sucrose buffer, pH 7.4 [KCl (5 mM), N...
In DepthDetails US Patent
TargetP2X purinoceptor 7(Homo sapiens (Human))
H. Lundbeck
US Patent
LigandPNGBDBM173676(US9102591, (+)2-chloro-N-[3-cyclopropyl-2-[6-(trif...)
Affinity DataIC50:  63nM. Assay description: Fluorescent Imaging Plate Reader (FLIPR) assay: Briefly, 293-human or mouse P2X7 stable cells were incubated in sucrose buffer, pH 7.4 [KCl (5 mM), N...
In DepthDetails US Patent
TargetP2X purinoceptor 7(Homo sapiens (Human))
H. Lundbeck
US Patent
LigandPNGBDBM173676(US9102591, (+)2-chloro-N-[3-cyclopropyl-2-[6-(trif...)
Affinity DataIC50:  2.30nM. Assay description: Fluorescent Imaging Plate Reader (FLIPR) assay: Briefly, 293-human or mouse P2X7 stable cells were incubated in sucrose buffer, pH 7.4 [KCl (5 mM), N...
In DepthDetails US Patent
TargetP2X purinoceptor 7(Homo sapiens (Human))
H. Lundbeck
US Patent
LigandPNGBDBM173676(US9102591, (+)2-chloro-N-[3-cyclopropyl-2-[6-(trif...)
Affinity DataIC50:  2.30nMpH: 7.4 T: 2°C. Assay description: Fluorescent Imaging Plate Reader (FLIPR) assay: Briefly, 293-human or mouse P2X7 stable cells were incubated in sucrose buffer, pH 7.4 [KCl (5 mM), N...
In DepthDetails US Patent