BDBM173749 US9102591, 2,3-dichloro-N-[2-(4-chlorophenyl)-2-tetrahydropyran-4-yl-ethyl]benzamide::US9649308, 2,3-dichloro-N-[2-(4-chlorophenyl)-2-tetrahydropyran-4-yl-ethyl]benzamide
SMILES Clc1ccc(cc1)C(CNC(=O)c1cccc(Cl)c1Cl)C1CCOCC1
InChI Key InChIKey=KTJQJDXYALLWBC-UHFFFAOYSA-N
Data  2 IC50
  Tab Delimited (TSV)   2D SDfile   Computed 3D by Vconf -m prep SDfile
Find this compound or compounds like it in BindingDB:
Activity Spreadsheet -- Enzyme Inhibition Constant Data from BindingDB
Found 2 hits for monomerid = 173749
TargetP2X purinoceptor 7(Homo sapiens (Human))
H. Lundbeck
US Patent
LigandPNGBDBM173749(US9102591, 2,3-dichloro-N-[2-(4-chlorophenyl)-2-te...)
Affinity DataIC50:  1.60nM. Assay description: Fluorescent Imaging Plate Reader (FLIPR) assay: Briefly, 293-human or mouse P2X7 stable cells were incubated in sucrose buffer, pH 7.4 [KCl (5 mM), N...
In DepthDetails US Patent
TargetP2X purinoceptor 7(Homo sapiens (Human))
H. Lundbeck
US Patent
LigandPNGBDBM173749(US9102591, 2,3-dichloro-N-[2-(4-chlorophenyl)-2-te...)
Affinity DataIC50:  1.60nMpH: 7.4 T: 2°C. Assay description: Fluorescent Imaging Plate Reader (FLIPR) assay: Briefly, 293-human or mouse P2X7 stable cells were incubated in sucrose buffer, pH 7.4 [KCl (5 mM), N...
In DepthDetails US Patent