BDBM173796 US9102591, (+)2,3-dichloro-N-[3-[1-(trifluoromethyl)cyclopropyl]-2-[2-(trifluoromethyl)pyrimidin-5-yl]propyl]benzamide::US9102591, (-)2,3-dichloro-N-[3-[1-(trifluoromethyl)cyclopropyl]-2-[2-(trifluoromethyl)pyrimidin-5-yl]propyl]benzamide::US9649308, (-)2,3-dichloro-N-[3-[1-(trifluoromethyl)cyclopropyl]-2-[2-(trifluoromethyl)pyrimidin-5-yl]propyl]benzamide
SMILES FC(F)(F)c1ncc(cn1)C(CNC(=O)c1cccc(Cl)c1Cl)CC1(CC1)C(F)(F)F
InChI Key InChIKey=GAXAVEJOQGMPBF-UHFFFAOYSA-N
Data  4 IC50
  Tab Delimited (TSV)   2D SDfile   Computed 3D by Vconf -m prep SDfile
Find this compound or compounds like it in BindingDB:
Activity Spreadsheet -- Enzyme Inhibition Constant Data from BindingDB
Found 4 hits for monomerid = 173796
TargetP2X purinoceptor 7(Homo sapiens (Human))
H. Lundbeck
US Patent
LigandPNGBDBM173796(US9102591, (+)2,3-dichloro-N-[3-[1-(trifluoromethy...)
Affinity DataIC50:  1.60nMpH: 7.4 T: 2°C. Assay description: Fluorescent Imaging Plate Reader (FLIPR) assay: Briefly, 293-human or mouse P2X7 stable cells were incubated in sucrose buffer, pH 7.4 [KCl (5 mM), N...
In DepthDetails US Patent
TargetP2X purinoceptor 7(Homo sapiens (Human))
H. Lundbeck
US Patent
LigandPNGBDBM173796(US9102591, (+)2,3-dichloro-N-[3-[1-(trifluoromethy...)
Affinity DataIC50:  21nM. Assay description: Fluorescent Imaging Plate Reader (FLIPR) assay: Briefly, 293-human or mouse P2X7 stable cells were incubated in sucrose buffer, pH 7.4 [KCl (5 mM), N...
In DepthDetails US Patent
TargetP2X purinoceptor 7(Homo sapiens (Human))
H. Lundbeck
US Patent
LigandPNGBDBM173796(US9102591, (+)2,3-dichloro-N-[3-[1-(trifluoromethy...)
Affinity DataIC50:  1.60nM. Assay description: Fluorescent Imaging Plate Reader (FLIPR) assay: Briefly, 293-human or mouse P2X7 stable cells were incubated in sucrose buffer, pH 7.4 [KCl (5 mM), N...
In DepthDetails US Patent
TargetP2X purinoceptor 7(Homo sapiens (Human))
H. Lundbeck
US Patent
LigandPNGBDBM173796(US9102591, (+)2,3-dichloro-N-[3-[1-(trifluoromethy...)
Affinity DataIC50:  21nMpH: 7.4 T: 2°C. Assay description: Fluorescent Imaging Plate Reader (FLIPR) assay: Briefly, 293-human or mouse P2X7 stable cells were incubated in sucrose buffer, pH 7.4 [KCl (5 mM), N...
In DepthDetails US Patent