BDBM173832 US9102591, (+)2-chloro-6-fluoro-N-[2-(4-fluorophenyl)-2-[2-(trifluoromethyl)pyrimidin-5-yl]ethyl]benzamide::US9102591, (-)2-chloro-6-fluoro-N-[2-(4-fluorophenyl)-2-[2-(trifluoromethyl)pyrimidin-5-yl]ethyl]benzamide::US9649308, (-)2-chloro-6-fluoro-N-[2-(4-fluorophenyl)-2-[2-(trifluoromethyl)pyrimidin-5-yl]ethyl]benzamide
SMILES Fc1ccc(cc1)C(CNC(=O)c1c(F)cccc1Cl)c1cnc(nc1)C(F)(F)F
InChI Key InChIKey=YADAFFKKFONQQM-UHFFFAOYSA-N
Data  4 IC50
  Tab Delimited (TSV)   2D SDfile   Computed 3D by Vconf -m prep SDfile
Find this compound or compounds like it in BindingDB:
Activity Spreadsheet -- Enzyme Inhibition Constant Data from BindingDB
Found 4 hits for monomerid = 173832
TargetP2X purinoceptor 7(Homo sapiens (Human))
H. Lundbeck
US Patent
LigandPNGBDBM173832(US9102591, (+)2-chloro-6-fluoro-N-[2-(4-fluorophen...)
Affinity DataIC50:  6.70nMpH: 7.4 T: 2°C. Assay description: Fluorescent Imaging Plate Reader (FLIPR) assay: Briefly, 293-human or mouse P2X7 stable cells were incubated in sucrose buffer, pH 7.4 [KCl (5 mM), N...
In DepthDetails US Patent
TargetP2X purinoceptor 7(Homo sapiens (Human))
H. Lundbeck
US Patent
LigandPNGBDBM173832(US9102591, (+)2-chloro-6-fluoro-N-[2-(4-fluorophen...)
Affinity DataIC50:  2.60nM. Assay description: Fluorescent Imaging Plate Reader (FLIPR) assay: Briefly, 293-human or mouse P2X7 stable cells were incubated in sucrose buffer, pH 7.4 [KCl (5 mM), N...
In DepthDetails US Patent
TargetP2X purinoceptor 7(Homo sapiens (Human))
H. Lundbeck
US Patent
LigandPNGBDBM173832(US9102591, (+)2-chloro-6-fluoro-N-[2-(4-fluorophen...)
Affinity DataIC50:  6.70nM. Assay description: Fluorescent Imaging Plate Reader (FLIPR) assay: Briefly, 293-human or mouse P2X7 stable cells were incubated in sucrose buffer, pH 7.4 [KCl (5 mM), N...
In DepthDetails US Patent
TargetP2X purinoceptor 7(Homo sapiens (Human))
H. Lundbeck
US Patent
LigandPNGBDBM173832(US9102591, (+)2-chloro-6-fluoro-N-[2-(4-fluorophen...)
Affinity DataIC50:  2.60nMpH: 7.4 T: 2°C. Assay description: Fluorescent Imaging Plate Reader (FLIPR) assay: Briefly, 293-human or mouse P2X7 stable cells were incubated in sucrose buffer, pH 7.4 [KCl (5 mM), N...
In DepthDetails US Patent