BDBM17465 1,2,3-triazole analogue, 21::N-benzyl-3-(1H-1,2,3-triazol-5-yl)aniline
SMILES C(Nc1cccc(c1)-c1c[nH]nn1)c1ccccc1
InChI Key InChIKey=ICNTYHGHXVHTHC-UHFFFAOYSA-N
Data  1 KI
  Tab Delimited (TSV)   2D SDfile   Computed 3D by Vconf -m prep SDfile
Find this compound or compounds like it in BindingDB:
Activity Spreadsheet -- Enzyme Inhibition Constant Data from BindingDB
Found 1 hit for monomerid = 17465
TargetMethionine aminopeptidase 2(Homo sapiens (Human))
Gsk
LigandPNGBDBM17465(1,2,3-triazole analogue, 21 | N-benzyl-3-(1H-1,2,3...)
Affinity DataKi:  29nM ΔG°:  -10.2kcal/molepH: 7.5 T: 2°C. Assay description: MetAP2 activity was monitored by measuring the initial velocity of turnover of the artificial substrate Met-AMC. Assays were performed in 96-well mi...
Ligand InfoPC cidPC sid
In DepthDetails ArticlePubMed