BDBM176360 US9688696, 76
SMILES Clc1ccccc1NC(=O)N1CCN(CC1)c1ccc(cc1)-c1noc(n1)C1CCCCC1
InChI Key InChIKey=HALLIWVWPVEGMI-UHFFFAOYSA-N
Data  1 IC50
  Tab Delimited (TSV)   2D SDfile   Computed 3D by Vconf -m prep SDfile
Find this compound or compounds like it in BindingDB:
Activity Spreadsheet -- Enzyme Inhibition Constant Data from BindingDB
Found 1 hit for monomerid = 176360
TargetDiacylglycerol O-acyltransferase 1(Homo sapiens (Human))
Janssen Pharmaceutica
US Patent
LigandPNGBDBM176360(US9688696, 76)
Affinity DataIC50:  1.35E+3nMpH: 7.4 T: 2°C. Assay description: DGAT activity in membrane preparations was assayed in 50 mM Tris-HCl (pH 7.4), 150 mM MgCl2, 1 mM EDTA and 0.2% BSA, containing 50 μM DAG, 32 &#...
In DepthDetails US Patent