BDBM17768 3-{2-carboxy-2-[3-(methylsulfanyl)propyl]ethyl}benzoic acid::Thiol-Based Inhibitor, 13
SMILES CSCCCC(Cc1cccc(c1)C(O)=O)C(O)=O
InChI Key InChIKey=AIYUYGAIQKHWOE-UHFFFAOYSA-N
Data  1 IC50
  Tab Delimited (TSV)   2D SDfile   Computed 3D by Vconf -m prep SDfile
Find this compound or compounds like it in BindingDB:
Activity Spreadsheet -- Enzyme Inhibition Constant Data from BindingDB
Found 1 hit for monomerid = 17768
TargetGlutamate carboxypeptidase 2 [44-750](Homo sapiens (Human))
Mgi Pharma
LigandPNGBDBM17768(3-{2-carboxy-2-[3-(methylsulfanyl)propyl]ethyl}ben...)
Affinity DataIC50: >2.00E+4nMpH: 7.4 T: 2°C. Assay description: GCPII activity in vitro is monitored through the hydrolysis [3H]NAAG to NAA and [3H]Glu. The radioactivity-based assay was miniaturized to a 96-well ...
In DepthDetails ArticlePubMed