BDBM178185 US9120808, Example 4
SMILES O=CC(CC=Cc1ccccc1)=C1O[C@@H]2CC(=O)N2C1C(=O)OCc1ccccc1
InChI Key InChIKey=NMQXSANBHIOUJJ-TYJSTWMOSA-N
Data  2 IC50
  Tab Delimited (TSV)   2D SDfile   Computed 3D by Vconf -m prep SDfile
Find this compound or compounds like it in BindingDB:
Activity Spreadsheet -- Enzyme Inhibition Constant Data from BindingDB
Found 1 hit for monomerid = 178185
TargetBeta-lactamase(Escherichia coli)
Nabriva Therapeutics
US Patent
LigandPNGBDBM178185(US9120808, Example 4)
Affinity DataIC50:  2.47E+3nMpH: 7.0 T: 2°C. Assay description: The inhibitory concentrations (IC50, [uM]) of the beta -lactamase inhibitors against purified TEM-1, SHV-1 and AmpC beta -lactamases are assessed by ...
In DepthDetails US Patent