BDBM179065 US9126931, 760
SMILES CC1(C)c2[nH]c3cc(ccc3c2C(=O)c2cc(OC3CCOCC3)c(cc12)N1CCN(CC1)C1CCC1)C#N
InChI Key InChIKey=VQGRMDTWABEEDT-UHFFFAOYSA-N
Data  1 IC50
  Tab Delimited (TSV)   2D SDfile   Computed 3D by Vconf -m prep SDfile
Find this compound or compounds like it in BindingDB:
Activity Spreadsheet -- Enzyme Inhibition Constant Data from BindingDB
Found 1 hit for monomerid = 179065
TargetALK tyrosine kinase receptor(Homo sapiens (Human))
Chugai Seiyaku Kabushiki Kaisha
US Patent
LigandPNGBDBM179065(US9126931, 760)
Affinity DataIC50:  1.5nM. Assay description: ALK-inhibiting activity was measured by following an activity of inhibiting phosphorylation by biotinylated peptide (EGPWLEEEEEAYGWMDF). For the dete...
In DepthDetails US Patent