BDBM179556 US9126980, 1
SMILES CCCCN(CCCC)C(=O)c1cc(C)n(n1)-c1ccc(NS(=O)(=O)c2ccccc2)cc1C(=O)N1Cc2ccccc2C[C@H]1CO
InChI Key InChIKey=JNAYJJUKIHKGTL-PMERELPUSA-N
Data  2 IC50
  Tab Delimited (TSV)   2D SDfile   Computed 3D by Vconf -m prep SDfile
Find this compound or compounds like it in BindingDB:
Activity Spreadsheet -- Enzyme Inhibition Constant Data from BindingDB
Found 2 hits for monomerid = 179556
TargetApoptosis regulator Bcl-2(Homo sapiens (Human))
Novartis
US Patent
LigandPNGBDBM179556(US9126980, 1)
Affinity DataIC50:  519nM. Assay description: Methods for Determining IC50s.The present method includes utility of a Surface plasmon resonance (SPR)- based biosensor (Biacore GE Healthcare, Uppsa...
In DepthDetails US Patent
TargetApoptosis regulator Bcl-2(Homo sapiens (Human))
Novartis
US Patent
LigandPNGBDBM179556(US9126980, 1)
Affinity DataIC50:  692nM. Assay description: Methods for Determining IC50s.The present method includes utility of a Surface plasmon resonance (SPR)- based biosensor (Biacore GE Healthcare, Uppsa...
In DepthDetails US Patent