BDBM179562 US9126980, 7
SMILES CCCCN(CCCC)C(=O)c1cc(C)n(n1)-c1ccc(NS(=O)c2ccc(Br)c(Br)c2)cc1C(=O)N1Cc2ccccc2C[C@H]1CO
InChI Key InChIKey=JZCFHVPPSPENFW-SAUCOOFJSA-N
Data  2 IC50
  Tab Delimited (TSV)   2D SDfile   Computed 3D by Vconf -m prep SDfile
Find this compound or compounds like it in BindingDB:
Activity Spreadsheet -- Enzyme Inhibition Constant Data from BindingDB
Found 2 hits for monomerid = 179562
TargetApoptosis regulator Bcl-2(Homo sapiens (Human))
Novartis
US Patent
LigandPNGBDBM179562(US9126980, 7)
Affinity DataIC50:  474nM. Assay description: Methods for Determining IC50s.The present method includes utility of a Surface plasmon resonance (SPR)- based biosensor (Biacore GE Healthcare, Uppsa...
In DepthDetails US Patent
TargetApoptosis regulator Bcl-2(Homo sapiens (Human))
Novartis
US Patent
LigandPNGBDBM179562(US9126980, 7)
Affinity DataIC50:  638nM. Assay description: Methods for Determining IC50s.The present method includes utility of a Surface plasmon resonance (SPR)- based biosensor (Biacore GE Healthcare, Uppsa...
In DepthDetails US Patent