BDBM180278 US9133162, Example 9
SMILES Cc1c(C(=O)Nc2ccc(Oc3ccnc4cc(OCC(C)(C)O)ccc34)cc2)c(=O)n(-c2ccccc2)n1C
InChI Key InChIKey=JNVFMMAYSXTMTJ-UHFFFAOYSA-N
Data  2 IC50
  Tab Delimited (TSV)   2D SDfile   Computed 3D by Vconf -m prep SDfile
Find this compound or compounds like it in BindingDB:
Activity Spreadsheet -- Enzyme Inhibition Constant Data from BindingDB
Found 2 hits for monomerid = 180278
TargetTyrosine-protein kinase receptor UFO(Homo sapiens (Human))
Sunshine Lake Pharma
US Patent
LigandPNGBDBM180278(US9133162, Example 9)
Affinity DataIC50:  5nMpH: 7.0 T: 2°C. Assay description: Axl (h) is incubated with 8 mM MOPS pH 7.0, 0.2 mM EDTA, 250 μM KKSRGDYMTMQIG, 10 mM MgAcetate and [γ-33P-ATP] (specific activity approx. 5...
In DepthDetails US Patent
TargetHepatocyte growth factor receptor(Homo sapiens (Human))
Sunshine Lake Pharma
US Patent
LigandPNGBDBM180278(US9133162, Example 9)
Affinity DataIC50:  13nMpH: 7.0 T: 2°C. Assay description: Met (h) is incubated with 8 mM MOPS pH 7.0, 0.2 mM EDTA, 250 μM KKKSPGEYVNIEFG, 10 mM MgAcetate and [γ-33P-ATP] (specific activity approx. ...
In DepthDetails US Patent