BDBM181228 US9139529, 71::US9783501, Compound 71
SMILES Cc1cc(Cl)ccc1Oc1nc2ccccc2cc1C(=O)Nc1cccc(c1)S(N)(=O)=O
InChI Key InChIKey=BJPFKPUSYBFQAD-UHFFFAOYSA-N
Data  2 IC50
  Tab Delimited (TSV)   2D SDfile   Computed 3D by Vconf -m prep SDfile
Find this compound or compounds like it in BindingDB:
Activity Spreadsheet -- Enzyme Inhibition Constant Data from BindingDB
Found 1 hit for monomerid = 181228
TargetSodium channel protein type 10 subunit alpha(Rattus norvegicus (Rat))
Vertex Pharmaceuticals
US Patent
LigandPNGBDBM181228(US9139529, 71 | US9783501, Compound 71)
Affinity DataIC50:  14nM. Assay description: Patch clamp electrophysiology was used to assess the efficacy and selectivity of sodium channel blockers in dorsal root ganglion neurons. Rat neurons...
In DepthDetails US Patent