BDBM181483 US9139577, 3.044::US9708274, 3.044
SMILES Cc1cc(cc2ncnc(Nc3ccc(F)cc3OCC3COCCO3)c12)N=S(C)(C)=O
InChI Key InChIKey=JFHNXXQLWRUNFA-UHFFFAOYSA-N
Data  2 IC50
  Tab Delimited (TSV)   2D SDfile   Computed 3D by Vconf -m prep SDfile
Find this compound or compounds like it in BindingDB:
Activity Spreadsheet -- Enzyme Inhibition Constant Data from BindingDB
Found 2 hits for monomerid = 181483
TargetMAP kinase-interacting serine/threonine-protein kinase 2(Homo sapiens (Human))
Evotec International
US Patent
LigandPNGBDBM181483(US9139577, 3.044 | US9708274, 3.044)
Affinity DataIC50:  63nMT: 2°C. Assay description: The inhibition of kinase activity of MNK2a was assessed using pre-activated GST-MNK2a. The white, 384-well OptiPlate F plates were purchased from Per...
In DepthDetails US Patent
TargetMAP kinase-interacting serine/threonine-protein kinase 2(Homo sapiens (Human))
Evotec International
US Patent
LigandPNGBDBM181483(US9139577, 3.044 | US9708274, 3.044)
Affinity DataIC50:  63nM. Assay description: The inhibition of kinase activity of MNK2a was assessed using pre-activated GST-MNK2a. The white, 384-well OptiPlate F plates were purchased from Per...
In DepthDetails US Patent