BDBM181719 US9139585, 14
SMILES Cc1cc(ccc1-n1cnnn1)S(=O)(=O)N1C[C@@H]2C[C@H]1CN2C[C@H](O)c1ccc2C(=O)OCc2c1C
InChI Key InChIKey=KNSFCUPEKGBOAJ-QQMNAOGKSA-N
Data  1 IC50
  Tab Delimited (TSV)   2D SDfile   Computed 3D by Vconf -m prep SDfile
Find this compound or compounds like it in BindingDB:
Activity Spreadsheet -- Enzyme Inhibition Constant Data from BindingDB
Found 1 hit for monomerid = 181719
TargetATP-sensitive inward rectifier potassium channel 1(Homo sapiens (Human))
Merck Sharp & Dohme
US Patent
LigandPNGBDBM181719(US9139585, 14)
Affinity DataIC50:  270nMpH: 7.4 T: 2°C. Assay description: Block of Kir1.1 (ROMK1) currents was examined by whole cell voltage clamp (Hamill et. al. Pfluegers Archives 391:85-100 (1981)) using the IonWorks Qu...
In DepthDetails US Patent