BDBM18453 1-({4-[(2-methoxyphenyl)amino]-6-(pyrrolidin-1-yl)-1,3,5-triazin-2-yl}amino)propan-2-ol::triazine scaffold, 12
SMILES COc1ccccc1Nc1nc(NCC(C)O)nc(n1)N1CCCC1
InChI Key InChIKey=LEFTURAFKSDISD-UHFFFAOYSA-N
Data  1 IC50
  Tab Delimited (TSV)   2D SDfile   Computed 3D by Vconf -m prep SDfile
Find this compound or compounds like it in BindingDB:
Activity Spreadsheet -- Enzyme Inhibition Constant Data from BindingDB
Found 1 hit for monomerid = 18453
TargetLysosomal acid glucosylceramidase(Homo sapiens (Human))
Nih
LigandPNGBDBM18453(1-({4-[(2-methoxyphenyl)amino]-6-(pyrrolidin-1-yl)...)
Affinity DataIC50:  2.07E+4nMpH: 5.9 T: 2°C. Assay description: Enzyme activity was determined as the production of fluorescent resorufin from the substrate. The fluorescence was measured (excitation 570 nm, emiss...
In DepthDetails ArticlePubMed