BDBM18458 2-{[4-(benzylamino)-6-[(2-methoxyphenyl)amino]-1,3,5-triazin-2-yl]amino}ethan-1-ol::triazine scaffold, 22
SMILES COc1ccccc1Nc1nc(NCCO)nc(NCc2ccccc2)n1
InChI Key InChIKey=DTQBPPDWCDHMOI-UHFFFAOYSA-N
Data  1 IC50
  Tab Delimited (TSV)   2D SDfile   Computed 3D by Vconf -m prep SDfile
Find this compound or compounds like it in BindingDB:
Activity Spreadsheet -- Enzyme Inhibition Constant Data from BindingDB
Found 1 hit for monomerid = 18458
TargetLysosomal acid glucosylceramidase(Homo sapiens (Human))
Nih
LigandPNGBDBM18458(2-{[4-(benzylamino)-6-[(2-methoxyphenyl)amino]-1,3...)
Affinity DataIC50:  1.88E+4nMpH: 5.9 T: 2°C. Assay description: Enzyme activity was determined as the production of fluorescent resorufin from the substrate. The fluorescence was measured (excitation 570 nm, emiss...
Ligand InfoPC cidPC sid
In DepthDetails ArticlePubMed