BDBM18459 2-{[4-(3,3-difluoropyrrolidin-1-yl)-6-[(2-methoxyphenyl)amino]-1,3,5-triazin-2-yl]amino}ethan-1-ol::triazine scaffold, 23
SMILES COc1ccccc1Nc1nc(NCCO)nc(n1)N1CCC(F)(F)C1
InChI Key InChIKey=BBXZEECKMNPTIO-UHFFFAOYSA-N
Data  1 IC50
  Tab Delimited (TSV)   2D SDfile   Computed 3D by Vconf -m prep SDfile
Find this compound or compounds like it in BindingDB:
Activity Spreadsheet -- Enzyme Inhibition Constant Data from BindingDB
Found 1 hit for monomerid = 18459
TargetLysosomal acid glucosylceramidase(Homo sapiens (Human))
Nih
LigandPNGBDBM18459(2-{[4-(3,3-difluoropyrrolidin-1-yl)-6-[(2-methoxyp...)
Affinity DataIC50:  7.75E+3nMpH: 5.9 T: 2°C. Assay description: Enzyme activity was determined as the production of fluorescent resorufin from the substrate. The fluorescence was measured (excitation 570 nm, emiss...
In DepthDetails ArticlePubMed