BDBM184629 US9156810, (50, 51)
SMILES COC(=O)CCC\C=C/C[C@@H]1[C@@H](\C=C\C(O)CCc2ccccc2)[C@H](O)C(C)(C)C1=O
InChI Key InChIKey=ZELKHLBDQHQEJW-NRBAOQCDSA-N
Data  4 IC50  2 EC50
  Tab Delimited (TSV)   2D SDfile   Computed 3D by Vconf -m prep SDfile
Find this compound or compounds like it in BindingDB:
Activity Spreadsheet -- Enzyme Inhibition Constant Data from BindingDB
Found 4 hits for monomerid = 184629
TargetDimer of Prostaglandin E2 receptor EP3 subtype(Homo sapiens (Human))
Allergan
US Patent
LigandPNGBDBM184629(US9156810, (50, 51))
Affinity DataIC50:  6.61E+3nM EC50: >1.00E+4nMpH: 7.4 T: 2°C. Assay description: HEK-293 cells stably expressing the human or feline FP receptor, or EP1, EP2, EP3, or EP4 receptors were washed with TME buffer, scraped from the bot...
In DepthDetails US Patent
TargetProstaglandin E2 receptor EP1 subtype(Homo sapiens (Human))
Allergan
US Patent
LigandPNGBDBM184629(US9156810, (50, 51))
Affinity DataIC50:  638nMpH: 7.4 T: 2°C. Assay description: HEK-293 cells stably expressing the human or feline FP receptor, or EP1, EP2, EP3, or EP4 receptors were washed with TME buffer, scraped from the bot...
In DepthDetails US Patent
TargetProstaglandin E2 receptor EP4 subtype(Homo sapiens (Human))
Allergan
US Patent
LigandPNGBDBM184629(US9156810, (50, 51))
Affinity DataIC50:  700nMpH: 7.4 T: 2°C. Assay description: HEK-293 cells stably expressing the human or feline FP receptor, or EP1, EP2, EP3, or EP4 receptors were washed with TME buffer, scraped from the bot...
In DepthDetails US Patent
TargetProstaglandin E2 receptor EP4 subtype(Homo sapiens (Human))
Allergan
US Patent
LigandPNGBDBM184629(US9156810, (50, 51))
Affinity DataIC50:  2.40E+3nM EC50:  3.16E+3nMpH: 7.4 T: 2°C. Assay description: HEK-293 cells stably expressing the human or feline FP receptor, or EP1, EP2, EP3, or EP4 receptors were washed with TME buffer, scraped from the bot...
In DepthDetails US Patent