BDBM18466 2-({4-[(3-methoxyphenyl)amino]-6-(pyrrolidin-1-yl)-1,3,5-triazin-2-yl}amino)ethan-1-ol::triazine scaffold, 32
SMILES COc1cccc(Nc2nc(NCCO)nc(n2)N2CCCC2)c1
InChI Key InChIKey=ZWMFEPYFXMGRTF-UHFFFAOYSA-N
Data  1 IC50
  Tab Delimited (TSV)   2D SDfile   Computed 3D by Vconf -m prep SDfile
Find this compound or compounds like it in BindingDB:
Activity Spreadsheet -- Enzyme Inhibition Constant Data from BindingDB
Found 1 hit for monomerid = 18466
TargetLysosomal acid glucosylceramidase(Homo sapiens (Human))
Nih
LigandPNGBDBM18466(2-({4-[(3-methoxyphenyl)amino]-6-(pyrrolidin-1-yl)...)
Affinity DataIC50:  8.25E+3nMpH: 5.9 T: 2°C. Assay description: Enzyme activity was determined as the production of fluorescent resorufin from the substrate. The fluorescence was measured (excitation 570 nm, emiss...
In DepthDetails ArticlePubMed