BDBM18467 2-({4-[(4-methoxyphenyl)amino]-6-(pyrrolidin-1-yl)-1,3,5-triazin-2-yl}amino)ethan-1-ol::triazine scaffold, 33
SMILES COc1ccc(Nc2nc(NCCO)nc(n2)N2CCCC2)cc1
InChI Key InChIKey=QDGWCTLLQIUYEH-UHFFFAOYSA-N
Data  1 IC50
  Tab Delimited (TSV)   2D SDfile   Computed 3D by Vconf -m prep SDfile
Find this compound or compounds like it in BindingDB:
Activity Spreadsheet -- Enzyme Inhibition Constant Data from BindingDB
Found 1 hit for monomerid = 18467
TargetLysosomal acid glucosylceramidase(Homo sapiens (Human))
Nih
LigandPNGBDBM18467(2-({4-[(4-methoxyphenyl)amino]-6-(pyrrolidin-1-yl)...)
Affinity DataIC50:  8.80E+3nMpH: 5.9 T: 2°C. Assay description: Enzyme activity was determined as the production of fluorescent resorufin from the substrate. The fluorescence was measured (excitation 570 nm, emiss...
In DepthDetails ArticlePubMed