BDBM18470 2-({4-[(2-phenoxyphenyl)amino]-6-(pyrrolidin-1-yl)-1,3,5-triazin-2-yl}amino)ethan-1-ol::triazine scaffold, 36
SMILES OCCNc1nc(Nc2ccccc2Oc2ccccc2)nc(n1)N1CCCC1
InChI Key InChIKey=SOJHGFJRAQRFOT-UHFFFAOYSA-N
Data  1 IC50
  Tab Delimited (TSV)   2D SDfile   Computed 3D by Vconf -m prep SDfile
Find this compound or compounds like it in BindingDB:
Activity Spreadsheet -- Enzyme Inhibition Constant Data from BindingDB
Found 1 hit for monomerid = 18470
TargetLysosomal acid glucosylceramidase(Homo sapiens (Human))
Nih
LigandPNGBDBM18470(2-({4-[(2-phenoxyphenyl)amino]-6-(pyrrolidin-1-yl)...)
Affinity DataIC50:  2.17E+4nM. Assay description: Enzyme activity was determined as the production of fluorescent resorufin from the substrate. The fluorescence was measured (excitation 570 nm, emiss...
In DepthDetails ArticlePubMed