BDBM18474 2-[(4-{[2-(methylsulfanyl)phenyl]amino}-6-(pyrrolidin-1-yl)-1,3,5-triazin-2-yl)amino]ethan-1-ol::triazine scaffold, 40
SMILES CSc1ccccc1Nc1nc(NCCO)nc(n1)N1CCCC1
InChI Key InChIKey=LOVNEHZOSOGCRZ-UHFFFAOYSA-N
Data  1 IC50
  Tab Delimited (TSV)   2D SDfile   Computed 3D by Vconf -m prep SDfile
Find this compound or compounds like it in BindingDB:
Activity Spreadsheet -- Enzyme Inhibition Constant Data from BindingDB
Found 1 hit for monomerid = 18474
TargetLysosomal acid glucosylceramidase(Homo sapiens (Human))
Nih
LigandPNGBDBM18474(2-[(4-{[2-(methylsulfanyl)phenyl]amino}-6-(pyrroli...)
Affinity DataIC50:  2.39E+3nM. Assay description: Enzyme activity was determined as the production of fluorescent resorufin from the substrate. The fluorescence was measured (excitation 570 nm, emiss...
Ligand InfoPC cidPC sid
In DepthDetails ArticlePubMed