BDBM186193 US9163013, 10
SMILES COc1ccc2[nH]nc(C(=O)NCC3CCN(Cc4nc(co4)C(O)=O)CC3)c2c1
InChI Key InChIKey=NWKSXGISQIPVIA-UHFFFAOYSA-N
Data  1 IC50
  Tab Delimited (TSV)   2D SDfile   Computed 3D by Vconf -m prep SDfile
Find this compound or compounds like it in BindingDB:
Activity Spreadsheet -- Enzyme Inhibition Constant Data from BindingDB
Found 1 hit for monomerid = 186193
TargetGlycogen synthase kinase-3 beta(Homo sapiens (Human))
Aziende Chimiche Riunite Angelini Francesco A.C.R.A.F.
US Patent
LigandPNGBDBM186193(US9163013, 10)
Affinity DataIC50:  310nMT: 2°C. Assay description: Activity on human GSK-3beta was assessed using the following methods (according to Meijer et al., Chem. Biol., 2003-10:1255-1266).In a first screenin...
In DepthDetails US Patent