BDBM186196 US9163013, 13
SMILES CCOC(=O)c1nc(CN2CCC(CNC(=O)c3n[nH]c4ccc(OC)cc34)CC2)cs1
InChI Key InChIKey=OYBVLGCDIMQTKJ-UHFFFAOYSA-N
Data  1 IC50
  Tab Delimited (TSV)   2D SDfile   Computed 3D by Vconf -m prep SDfile
Find this compound or compounds like it in BindingDB:
Activity Spreadsheet -- Enzyme Inhibition Constant Data from BindingDB
Found 1 hit for monomerid = 186196
TargetGlycogen synthase kinase-3 beta(Homo sapiens (Human))
Aziende Chimiche Riunite Angelini Francesco A.C.R.A.F.
US Patent
LigandPNGBDBM186196(US9163013, 13)
Affinity DataIC50:  950nMT: 2°C. Assay description: Activity on human GSK-3beta was assessed using the following methods (according to Meijer et al., Chem. Biol., 2003-10:1255-1266).In a first screenin...
Ligand InfoPC cidPC sid
In DepthDetails US Patent