BDBM186204 US9163013, 21
SMILES COc1ccncc1-c1ccc2[nH]nc(C(=O)NCC3CCN(Cc4ccc(o4)C(O)=O)CC3)c2c1
InChI Key InChIKey=CLXUTTCVUYWIGF-UHFFFAOYSA-N
Data  2 IC50
  Tab Delimited (TSV)   2D SDfile   Computed 3D by Vconf -m prep SDfile
Find this compound or compounds like it in BindingDB:
Activity Spreadsheet -- Enzyme Inhibition Constant Data from BindingDB
Found 2 hits for monomerid = 186204
TargetGlycogen synthase kinase-3 beta(Homo sapiens (Human))
Angelini
Curated by ChEMBL
LigandPNGBDBM186204(US9163013, 21)
Affinity DataIC50:  9.60nM. Assay description: Inhibition of human recombinant GSK-3beta using Ulight-CFFKNIVTPRTPPPSQQGK-amide as substrate after 90 mins by LANCE assay
In DepthDetails ArticlePubMed
TargetGlycogen synthase kinase-3 beta(Homo sapiens (Human))
Angelini
Curated by ChEMBL
LigandPNGBDBM186204(US9163013, 21)
Affinity DataIC50:  10nMT: 2°C. Assay description: Activity on human GSK-3beta was assessed using the following methods (according to Meijer et al., Chem. Biol., 2003-10:1255-1266).In a first screenin...
In DepthDetails US Patent