BDBM186206 US9163013, 23
SMILES CCOC(=O)c1ccc(CN2CCC(CNC(=O)c3n[nH]c4ccc(OC)cc34)CC2)o1
InChI Key InChIKey=XEMAVFCCICEWKH-UHFFFAOYSA-N
Data  1 IC50
  Tab Delimited (TSV)   2D SDfile   Computed 3D by Vconf -m prep SDfile
Find this compound or compounds like it in BindingDB:
Activity Spreadsheet -- Enzyme Inhibition Constant Data from BindingDB
Found 1 hit for monomerid = 186206
TargetGlycogen synthase kinase-3 beta(Homo sapiens (Human))
Aziende Chimiche Riunite Angelini Francesco A.C.R.A.F.
US Patent
LigandPNGBDBM186206(US9163013, 23)
Affinity DataIC50:  330nMT: 2°C. Assay description: Activity on human GSK-3beta was assessed using the following methods (according to Meijer et al., Chem. Biol., 2003-10:1255-1266).In a first screenin...
In DepthDetails US Patent