BDBM186355 US9163021, 12
SMILES CC(C)(CO)n1cc(C(=O)c2cncc(NC(=O)Cc3ccc(cc3)C#N)c2)c2cnccc12
InChI Key InChIKey=KNQUZBXKJSAGKQ-UHFFFAOYSA-N
Data  1 IC50
  Tab Delimited (TSV)   2D SDfile   Computed 3D by Vconf -m prep SDfile
Find this compound or compounds like it in BindingDB:
Activity Spreadsheet -- Enzyme Inhibition Constant Data from BindingDB
Found 1 hit for monomerid = 186355
TargetHigh affinity nerve growth factor receptor(Homo sapiens (Human))
Pfizer
US Patent
LigandPNGBDBM186355(US9163021, 12)
Affinity DataIC50:  9.54nM. Assay description: Isolated TRK Enzyme assays use the HTRF KinEASE-TK kit (Cisbio Cat#62TK0PEJ) with recombinant His-tagged cytoplasmic domains of each TRK receptor sou...
In DepthDetails US Patent