BDBM186375 US9163021, 32
SMILES CC(C)n1cc(C(=O)c2cncc(NC(=O)Cn3nc(cc3C)C(F)(F)F)c2)c2cncc(F)c12
InChI Key InChIKey=GWHBTXYPXPOISG-UHFFFAOYSA-N
Data  1 IC50
  Tab Delimited (TSV)   2D SDfile   Computed 3D by Vconf -m prep SDfile
Find this compound or compounds like it in BindingDB:
Activity Spreadsheet -- Enzyme Inhibition Constant Data from BindingDB
Found 1 hit for monomerid = 186375
TargetHigh affinity nerve growth factor receptor(Homo sapiens (Human))
Pfizer
US Patent
LigandPNGBDBM186375(US9163021, 32)
Affinity DataIC50:  11.4nM. Assay description: Isolated TRK Enzyme assays use the HTRF KinEASE-TK kit (Cisbio Cat#62TK0PEJ) with recombinant His-tagged cytoplasmic domains of each TRK receptor sou...
In DepthDetails US Patent