BDBM186420 US9163021, 78
SMILES CC(C)n1cc(C(=O)c2ccnc(NC(=O)Cc3nc(oc3C)C3CC3)c2)c2cnccc12
InChI Key InChIKey=JHZCKWHZLJKZHN-UHFFFAOYSA-N
Data  1 IC50
  Tab Delimited (TSV)   2D SDfile   Computed 3D by Vconf -m prep SDfile
Find this compound or compounds like it in BindingDB:
Activity Spreadsheet -- Enzyme Inhibition Constant Data from BindingDB
Found 1 hit for monomerid = 186420
TargetHigh affinity nerve growth factor receptor(Homo sapiens (Human))
Pfizer
US Patent
LigandPNGBDBM186420(US9163021, 78)
Affinity DataIC50:  15.8nM. Assay description: Isolated TRK Enzyme assays use the HTRF KinEASE-TK kit (Cisbio Cat#62TK0PEJ) with recombinant His-tagged cytoplasmic domains of each TRK receptor sou...
In DepthDetails US Patent