BDBM186978 US9169209, Table 3, Compound 9
SMILES O=C(Nc1ccc(cc1)S(=O)(=O)c1ccc2ncccc2c1)\C=C\c1cccnc1
InChI Key InChIKey=IKAMYJCLMWXSAO-LFYBBSHMSA-N
Data  1 IC50
  Tab Delimited (TSV)   2D SDfile   Computed 3D by Vconf -m prep SDfile
Find this compound or compounds like it in BindingDB:
Activity Spreadsheet -- Enzyme Inhibition Constant Data from BindingDB
Found 1 hit for monomerid = 186978
TargetNicotinamide phosphoribosyltransferase(Homo sapiens (Human))
Forma Tm
US Patent
LigandPNGBDBM186978(US9169209, Table 3, Compound 9)
Affinity DataIC50:  5.40nMpH: 7.5 T: 2°C. Assay description: The NAMPT enzymatic reactions were carried out in Buffer A (50 mM Hepes pH 7.5, 50 mM NaCl, 5 mM MgCl2, and 1 mM THP) in 96-well V-bottom plates. The...
In DepthDetails US Patent