BDBM191876 US9187429, 1
SMILES NC1CCCc2c1cncc2-c1ccc(cc1)C#N
InChI Key InChIKey=KAIKMBLZNQPQSC-UHFFFAOYSA-N
Data  1 IC50  2 EC50
  Tab Delimited (TSV)   2D SDfile   Computed 3D by Vconf -m prep SDfile
Find this compound or compounds like it in BindingDB:
Activity Spreadsheet -- Enzyme Inhibition Constant Data from BindingDB
Found 3 hits for monomerid = 191876
TargetCytochrome P450 11B1, mitochondrial(Homo sapiens (Human))
Hoffmann-La Roche
US Patent
LigandPNGBDBM191876(US9187429, 1)
Affinity DataEC50:  173nM. Assay description: G-402 cells can be obtained from ATCC(CRL-1440) and were originally derived from a renal leiomyoblastoma. The expression plasmids contains the ORF ...
Ligand InfoPC cidPC sid
In DepthDetails US Patent
TargetCytochrome P450 11B2, mitochondrial(Homo sapiens (Human))
Roche Pharma Research And Early Development (Pred)
Curated by ChEMBL
LigandPNGBDBM191876(US9187429, 1)
Affinity DataIC50:  42nM. Assay description: Inhibition of human CYP11B2 expressed in human renal leiomyoblastoma cells using 11-deoxycorticosterone as substrate assessed as formation of aldoste...
Ligand InfoPC cidPC sid
In DepthDetails ArticlePubMed
TargetCytochrome P450 11B2, mitochondrial(Homo sapiens (Human))
Roche Pharma Research And Early Development (Pred)
Curated by ChEMBL
LigandPNGBDBM191876(US9187429, 1)
Affinity DataEC50:  42nM. Assay description: G-402 cells can be obtained from ATCC(CRL-1440) and were originally derived from a renal leiomyoblastoma. The expression plasmids contains the ORF ...
Ligand InfoPC cidPC sid
In DepthDetails US Patent