BDBM191882 US9187429, 8
SMILES CC(=O)NC1CCCc2c1cncc2-c1ccc(cc1)C#N
InChI Key InChIKey=VTXPPXZJCHEWPW-UHFFFAOYSA-N
Data  4 IC50  2 EC50
  Tab Delimited (TSV)   2D SDfile   Computed 3D by Vconf -m prep SDfile
Find this compound or compounds like it in BindingDB:
Activity Spreadsheet -- Enzyme Inhibition Constant Data from BindingDB
Found 6 hits for monomerid = 191882
TargetCytochrome P450 11B1, mitochondrial(Homo sapiens (Human))
Hoffmann-La Roche
US Patent
LigandPNGBDBM191882(US9187429, 8)
Affinity DataEC50:  422nM. Assay description: G-402 cells can be obtained from ATCC(CRL-1440) and were originally derived from a renal leiomyoblastoma. The expression plasmids contains the ORF ...
In DepthDetails US Patent
TargetCytochrome P450 11B2, mitochondrial(Homo sapiens (Human))
Hoffmann-La Roche
US Patent
LigandPNGBDBM191882(US9187429, 8)
Affinity DataEC50:  43nM. Assay description: G-402 cells can be obtained from ATCC(CRL-1440) and were originally derived from a renal leiomyoblastoma. The expression plasmids contains the ORF ...
In DepthDetails US Patent
TargetCytochrome P450 2C9(Homo sapiens (Human))
Roche Pharma Research And Early Development (Pred)
Curated by ChEMBL
LigandPNGBDBM191882(US9187429, 8)
Affinity DataIC50: >5.00E+4nM. Assay description: Inhibition of CYP2C9 (unknown origin)
In DepthDetails ArticlePubMed
TargetCytochrome P450 11B2, mitochondrial(Homo sapiens (Human))
Hoffmann-La Roche
US Patent
LigandPNGBDBM191882(US9187429, 8)
Affinity DataIC50:  21nM. Assay description: Inhibition of human CYP11B2 expressed in human renal leiomyoblastoma cells using 11-deoxycorticosterone as substrate assessed as formation of aldoste...
In DepthDetails ArticlePubMed
TargetCytochrome P450 2D6(Homo sapiens (Human))
Roche Pharma Research And Early Development (Pred)
Curated by ChEMBL
LigandPNGBDBM191882(US9187429, 8)
Affinity DataIC50: >5.00E+4nM. Assay description: Inhibition of CYP2D6 (unknown origin)
In DepthDetails ArticlePubMed
TargetCytochrome P450 3A4(Homo sapiens (Human))
Roche Pharma Research And Early Development (Pred)
Curated by ChEMBL
LigandPNGBDBM191882(US9187429, 8)
Affinity DataIC50: >5.00E+4nM. Assay description: Inhibition of CYP3A4 (unknown origin)
In DepthDetails ArticlePubMed