BDBM192187 US10526329, Compound 84::US11072611, Compound 84::US9670204, 84 N-(2-ethyl-6-(1-(methylsulfonyl)piperidin-4-yl)imidazo[1,2-a]pyridin-3-yl)-N-methyl-4-(4-(trifluoromethyl)phenyl)thiazol-2-amine
SMILES CCc1nc2ccc(cn2c1N(C)c1nc(cs1)-c1ccc(cc1)C(F)(F)F)C1CCN(CC1)S(C)(=O)=O
InChI Key InChIKey=NHPZKKKSCYVHAN-UHFFFAOYSA-N
Data  4 IC50
  Tab Delimited (TSV)   2D SDfile   Computed 3D by Vconf -m prep SDfile
Find this compound or compounds like it in BindingDB:
Activity Spreadsheet -- Enzyme Inhibition Constant Data from BindingDB
Found 4 hits for monomerid = 192187
TargetEctonucleotide pyrophosphatase/phosphodiesterase family member 2(Homo sapiens (Human))
Galapagos
US Patent
LigandPNGBDBM192187(US10526329, Compound 84 | US11072611, Compound 84 ...)
Affinity DataIC50: >1.00E+3nMpH: 8.5 T: 2°C. Assay description: Compound IC50 values are determined in a hENPP2 (UniProtKB/SwissProt Sequence ref Q13822) biochemical assay using LPC as substrate. 5 μL of a di...
Ligand InfoPC cidPC sid
In DepthDetails US Patent
TargetEctonucleotide pyrophosphatase/phosphodiesterase family member 2(Homo sapiens (Human))
Galapagos
US Patent
LigandPNGBDBM192187(US10526329, Compound 84 | US11072611, Compound 84 ...)
Affinity DataIC50: >1.00E+3nM. Assay description: TABLE V: 5 μL of a dilution series of compound, starting from 20 μM highest concentration, 1/5 dilution, is added to the wells. hENPP2 is u...
Ligand InfoPC cidPC sid
In DepthDetails US Patent
TargetEctonucleotide pyrophosphatase/phosphodiesterase family member 2(Homo sapiens (Human))
Galapagos
US Patent
LigandPNGBDBM192187(US10526329, Compound 84 | US11072611, Compound 84 ...)
Affinity DataIC50: >1.00E+3nM. Assay description: Compound IC50 values are determined in a hENPP2 (UniProtKB/SwissProt Sequence ref Q13822) biochemical assay using LPC as substrate.5 μL of a dil...
Ligand InfoPC cidPC sid
In DepthDetails US Patent
TargetEctonucleotide pyrophosphatase/phosphodiesterase family member 2(Homo sapiens (Human))
Galapagos
US Patent
LigandPNGBDBM192187(US10526329, Compound 84 | US11072611, Compound 84 ...)
Affinity DataIC50:  1.00E+3nM. Assay description: Inhibition of glycosylated human ATX using LPC 16:0 as substrate after 30 mins by luminescence assay
Ligand InfoPC cidPC sid
In DepthDetails ArticlePubMed