BDBM192516 US9187477, 12
SMILES O[C@@H]1COC2[C@@H](COC12)Oc1nc2cc(Cl)c(nc2[nH]1)-c1ccc(cc1)[C@@H]1CC[C@@H](CC1)OC(=O)N1CCOCC1
InChI Key
Data  1 EC50
  Tab Delimited (TSV)   2D SDfile   Computed 3D by Vconf -m prep SDfile
Find this compound or compounds like it in BindingDB:
Activity Spreadsheet -- Enzyme Inhibition Constant Data from BindingDB
Found 1 hit for monomerid = 192516
Target5'-AMP-activated protein kinase catalytic subunit alpha-1(Homo sapiens (Human))
Boehringer Ingelheim International
US Patent
LigandPNGBDBM192516(US9187477, 12)
Affinity DataEC50:  1.31E+3nMpH: 7.0Assay Description:Activated AMPK complex 1 (containing alphal betalgammal ) was obtained from baculovirus expression system. The gene encoding AMPK alphal was cloned i...
In DepthDetails US Patent