BDBM192915 US10526329, Compound 129::US11072611, Compound 129::US9670204, 129 2-(dimethylamino)-1-(4-(2-ethyl-3-((4-(4-fluorophenyl)thiazol-2-yl)(methyl)amino)imidazo[1,2-a]pyridin-6-yl)piperidin-1-yl)ethanone
SMILES CCc1nc2ccc(cn2c1N(C)c1nc(cs1)-c1ccc(F)cc1)C1CCN(CC1)C(=O)CN(C)C
InChI Key InChIKey=NJZNRJUETMYVIR-UHFFFAOYSA-N
Data  3 IC50
  Tab Delimited (TSV)   2D SDfile   Computed 3D by Vconf -m prep SDfile
Find this compound or compounds like it in BindingDB:
Activity Spreadsheet -- Enzyme Inhibition Constant Data from BindingDB
Found 3 hits for monomerid = 192915
TargetEctonucleotide pyrophosphatase/phosphodiesterase family member 2(Homo sapiens (Human))
Galapagos
US Patent
LigandPNGBDBM192915(US10526329, Compound 129 | US11072611, Compound 12...)
Affinity DataIC50:  300nMpH: 8.5 T: 2°C. Assay description: Compound IC50 values are determined in a hENPP2 (UniProtKB/SwissProt Sequence ref Q13822) biochemical assay using LPC as substrate. 5 μL of a di...
Ligand InfoPC cidPC sid
In DepthDetails US Patent
TargetEctonucleotide pyrophosphatase/phosphodiesterase family member 2(Homo sapiens (Human))
Galapagos
US Patent
LigandPNGBDBM192915(US10526329, Compound 129 | US11072611, Compound 12...)
Affinity DataIC50:  300nM. Assay description: TABLE V: 5 μL of a dilution series of compound, starting from 20 μM highest concentration, 1/5 dilution, is added to the wells. hENPP2 is u...
Ligand InfoPC cidPC sid
In DepthDetails US Patent
TargetEctonucleotide pyrophosphatase/phosphodiesterase family member 2(Homo sapiens (Human))
Galapagos
US Patent
LigandPNGBDBM192915(US10526329, Compound 129 | US11072611, Compound 12...)
Affinity DataIC50:  300nM. Assay description: Compound IC50 values are determined in a hENPP2 (UniProtKB/SwissProt Sequence ref Q13822) biochemical assay using LPC as substrate.5 μL of a dil...
Ligand InfoPC cidPC sid
In DepthDetails US Patent