BDBM192946 US11072611, Compound 141::US9670204, 141 2-((2-ethyl-6-(1-(2-(3-hydroxyazetidin-1-yl)-2-oxoethyl)piperidin-4-yl)imidazo[1,2-a]pyridin-3-yl)(methyl)amino)-4-(4-fluorophenyl)thiazole-5-carbonitrile
SMILES CCc1nc2ccc(cn2c1N(C)c1nc(c(s1)C#N)-c1ccc(F)cc1)C1CCN(CC(=O)N2CC(O)C2)CC1
InChI Key InChIKey=USTXXAKVNIABFI-UHFFFAOYSA-N
Data  9 IC50
  Tab Delimited (TSV)   2D SDfile   Computed 3D by Vconf -m prep SDfile
Find this compound or compounds like it in BindingDB:
Activity Spreadsheet -- Enzyme Inhibition Constant Data from BindingDB
Found 9 hits for monomerid = 192946
TargetEctonucleotide pyrophosphatase/phosphodiesterase family member 2(Homo sapiens (Human))
Galapagos
US Patent
LigandPNGBDBM192946(US11072611, Compound 141 | US9670204, 141 2-((2-et...)
Affinity DataIC50:  50nMpH: 8.5 T: 2°C. Assay description: Compound IC50 values are determined in a hENPP2 (UniProtKB/SwissProt Sequence ref Q13822) biochemical assay using LPC as substrate. 5 μL of a di...
Ligand InfoPC cidPC sid
In DepthDetails US Patent
LigandPNGBDBM192946(US11072611, Compound 141 | US9670204, 141 2-((2-et...)
Affinity DataIC50:  22nM. Assay description: Inhibition of ATX in rat plasma assessed as reduction in plasma lysophosphatidic acid 18:2 levels after 2 hrs by LC-MS/MS method
Ligand InfoPC cidPC sid
In DepthDetails ArticlePubMed
TargetEctonucleotide pyrophosphatase/phosphodiesterase family member 2(Homo sapiens (Human))
Galapagos
US Patent
LigandPNGBDBM192946(US11072611, Compound 141 | US9670204, 141 2-((2-et...)
Affinity DataIC50:  27nM. Assay description: Inhibition of glycosylated human ATX using FS-3 as substrate preincubated for 30 mins followed by substrate addition measured after 30 mins by fluore...
Ligand InfoPC cidPC sid
In DepthDetails ArticlePubMed
TargetPotassium voltage-gated channel subfamily H member 2(Homo sapiens (Human))
Galapagos
Curated by ChEMBL
LigandPNGBDBM192946(US11072611, Compound 141 | US9670204, 141 2-((2-et...)
Affinity DataIC50:  2.90E+3nM. Assay description: Inhibition of human ERG by automated patch clamp assay
Ligand InfoPC cidPC sid
In DepthDetails ArticlePubMed
TargetEctonucleotide pyrophosphatase/phosphodiesterase family member 2(Homo sapiens (Human))
Galapagos
US Patent
LigandPNGBDBM192946(US11072611, Compound 141 | US9670204, 141 2-((2-et...)
Affinity DataIC50:  50nM. Assay description: TABLE VI: (UniProtKB/SwissProt Sequence ref Q13822) biochemical assay using the fluorogenic autotaxin substrate FS-3 as substrate. FS-3 is a doubly l...
Ligand InfoPC cidPC sid
In DepthDetails US Patent
LigandPNGBDBM192946(US11072611, Compound 141 | US9670204, 141 2-((2-et...)
Affinity DataIC50:  22nM. Assay description: Inhibition of ATX in rat plasma assessed as reduction in LPA 18:2 production after 2 hrs by LC-MS/MS analysis
Ligand InfoPC cidPC sid
In DepthDetails ArticlePubMed
TargetEctonucleotide pyrophosphatase/phosphodiesterase family member 2(Homo sapiens (Human))
Galapagos
US Patent
LigandPNGBDBM192946(US11072611, Compound 141 | US9670204, 141 2-((2-et...)
Affinity DataIC50:  27nM. Assay description: Inhibition of glycosylated human ATX using FS-3 as substrate preincubated for 30 mins followed by substrate addition measured after 30 mins by fluore...
Ligand InfoPC cidPC sid
In DepthDetails ArticlePubMed
TargetEctonucleotide pyrophosphatase/phosphodiesterase family member 2(Homo sapiens (Human))
Galapagos
US Patent
LigandPNGBDBM192946(US11072611, Compound 141 | US9670204, 141 2-((2-et...)
Affinity DataIC50:  50nM. Assay description: TABLE V: 5 μL of a dilution series of compound, starting from 20 μM highest concentration, 1/5 dilution, is added to the wells. hENPP2 is u...
Ligand InfoPC cidPC sid
In DepthDetails US Patent
TargetEctonucleotide pyrophosphatase/phosphodiesterase family member 2(Homo sapiens (Human))
Galapagos
US Patent
LigandPNGBDBM192946(US11072611, Compound 141 | US9670204, 141 2-((2-et...)
Affinity DataIC50:  27nM. Assay description: Inhibition of human ATX using LPC (16:0) as substrate after 30 mins by horseradish peroxidase/choline oxidase coupled enzyme based spectrophotometric...
Ligand InfoPC cidPC sid
In DepthDetails ArticlePubMed