BDBM192954 US9670204, 149 (2-((6-(1-(3-(dimethylamino)propyl-sulfonyl)piperidin-4-yl)-2-ethylimidazo[1,2-a]pyridin-3-yl)(methyl)amino)-4-(4-fluorophenyl)thiazol-5-yl)
SMILES CCc1nc2ccc(cn2c1N(C)c1nc(c(CO)s1)-c1ccc(F)cc1)C1CCN(CC1)S(=O)(=O)CCCN(C)C
InChI Key InChIKey=ZETQXDAORQIUDZ-UHFFFAOYSA-N
Data  1 IC50
  Tab Delimited (TSV)   2D SDfile   Computed 3D by Vconf -m prep SDfile
Find this compound or compounds like it in BindingDB:
Activity Spreadsheet -- Enzyme Inhibition Constant Data from BindingDB
Found 1 hit for monomerid = 192954
TargetEctonucleotide pyrophosphatase/phosphodiesterase family member 2(Homo sapiens (Human))
Galapagos
US Patent
LigandPNGBDBM192954(US9670204, 149 (2-((6-(1-(3-(dimethylamino)propyl-...)
Affinity DataIC50:  300nMpH: 8.5 T: 2°C. Assay description: Compound IC50 values are determined in a hENPP2 (UniProtKB/SwissProt Sequence ref Q13822) biochemical assay using LPC as substrate. 5 μL of a di...
Ligand InfoPC cidPC sid
In DepthDetails US Patent