BDBM193 (5R,6R)-1,5-dibenzyl-6-hydroxy-2,4-bis[(3-methoxyphenyl)methyl]-1,2,4-triazepan-3-one::Azacyclic Urea::Unnamed azacyclic urea
SMILES COc1cccc(CN2[C@H](Cc3ccccc3)[C@H](O)CN(Cc3ccccc3)N(Cc3cccc(OC)c3)C2=O)c1
InChI Key InChIKey=POTVKRBLAIMCGT-CZNDPXEESA-N
Data  1 KI
  Tab Delimited (TSV)   2D SDfile   Computed 3D by Vconf -m prep SDfile
Find this compound or compounds like it in BindingDB:
Activity Spreadsheet -- Enzyme Inhibition Constant Data from BindingDB
Found 1 hit for monomerid = 193
TargetDimer of Gag-Pol polyprotein [489-587](Human immunodeficiency virus type 1)
Abbott Laboratories
LigandPNGBDBM193((5R,6R)-1,5-dibenzyl-6-hydroxy-2,4-bis[(3-methoxyp...)
Affinity DataKi:  0.220nM ΔG°:  -13.4kcal/molepH: 4.7 T: 2°C. Assay description: HIV-1 protease activity was measured by a continuous fluorometric assay using the internally quenched fluorogenic substrate DABCYL-GABA-Ser-Gln-Tyr-P...
In DepthDetails ArticlePubMed