BDBM193653 US9199949, 15
SMILES O[C@H]1[C@@H](F)[C@H]2N=C(O[C@H]2C[C@@H]1C(F)F)N1CCC1
InChI Key InChIKey=FDBBKCHHRJFEKG-VCQFTWBDSA-N
Data  1 KI
  Tab Delimited (TSV)   2D SDfile   Computed 3D by Vconf -m prep SDfile
Find this compound or compounds like it in BindingDB:
Activity Spreadsheet -- Enzyme Inhibition Constant Data from BindingDB
Found 1 hit for monomerid = 193653
TargetProtein O-GlcNAcase(Homo sapiens (Human))
Alectos Therapeutics
US Patent
LigandPNGBDBM193653(US9199949, 15)
Affinity DataKi:  20.5nM ΔG°:  -10.5kcal/molepH: 7.0 T: 2°C. Assay description: Enzymatic reactions were carried out in a reaction containing 50 mM NaH2PO4, 100 mM NaCl and 0.1% BSA (pH 7.0) using 2 mM 4-Methylumbelliferyl N-acet...
In DepthDetails US Patent