BDBM196289 US9670216, 25 4-Chloro-2-(3,5-dichlorophenyl)-5-propylaminopyridazin-3-one
SMILES CCCN(C)c1cnn(-c2cc(Cl)cc(Cl)c2)c(=O)c1Cl
InChI Key InChIKey=QBYLLDNNOIUGPW-UHFFFAOYSA-N
Data  2 IC50
  Tab Delimited (TSV)   2D SDfile   Computed 3D by Vconf -m prep SDfile
Find this compound or compounds like it in BindingDB:
Activity Spreadsheet -- Enzyme Inhibition Constant Data from BindingDB
Found 2 hits for monomerid = 196289
TargetCannabinoid receptor 2(Homo sapiens (Human))
Allergan
US Patent
LigandPNGBDBM196289(US9670216, 25 4-Chloro-2-(3,5-dichlorophenyl)-5-pr...)
Affinity DataIC50: >1.00E+4nMT: 2°C. Assay description: Plasma membranes prepared from HEK 293 EBNA cells transfected with human CB1 or CB2 cannabinoid receptors (3.7 or 3.3 pmol/mg protein, receptor conce...
Ligand InfoPC cidPC sid
In DepthDetails US Patent
TargetCannabinoid receptor 1(Homo sapiens (Human))
Allergan
US Patent
LigandPNGBDBM196289(US9670216, 25 4-Chloro-2-(3,5-dichlorophenyl)-5-pr...)
Affinity DataIC50: >1.00E+4nMT: 2°C. Assay description: Plasma membranes prepared from HEK 293 EBNA cells transfected with human CB1 or CB2 cannabinoid receptors (3.7 or 3.3 pmol/mg protein, receptor conce...
Ligand InfoPC cidPC sid
In DepthDetails US Patent