BDBM196527 US9212165, 62
SMILES Fc1cncc(c1)C(=O)NC12CC3CC(C1)CC(C3)(C2)C#Cc1cnccn1
InChI Key InChIKey=NAPPIKLIVCBXGG-UHFFFAOYSA-N
Data  1 IC50
  Tab Delimited (TSV)   2D SDfile   Computed 3D by Vconf -m prep SDfile
Find this compound or compounds like it in BindingDB:
Activity Spreadsheet -- Enzyme Inhibition Constant Data from BindingDB
Found 1 hit for monomerid = 196527
TargetMetabotropic glutamate receptor 5(Homo sapiens (Human))
H. Lundbeck
US Patent
LigandPNGBDBM196527(US9212165, 62)
Affinity DataIC50:  30nMpH: 7.4Assay Description:The rmGluR5 or hmGluR5 was stably expressed in a HEK 293 cell line and gown in Dulbecco's Modified Eagle Medium (DMEM) (Invitrogen, Carlsbad, Cal...
Ligand InfoPC cidPC sid
In DepthDetails US Patent