BDBM197816 BDBM197817::US9216988, 63
SMILES CS(=O)(=O)NC1CCN(CC1)c1ccc(CN(CC(F)(F)F)S(=O)(=O)Cc2ccccc2)c(F)c1
InChI Key InChIKey=YFKDUQRNZGRACA-UHFFFAOYSA-N
Data  2 IC50
  Tab Delimited (TSV)   2D SDfile   Computed 3D by Vconf -m prep SDfile
Find this compound or compounds like it in BindingDB:
Activity Spreadsheet -- Enzyme Inhibition Constant Data from BindingDB
Found 2 hits for monomerid = 197816
TargetNuclear receptor ROR-gamma(Homo sapiens (Human))
Genentech
US Patent
LigandPNGBDBM197816(BDBM197817 | US9216988, 63)
Affinity DataIC50:  1.10E+3nMpH: 7.4Assay Description:On day of the assay, 100 uL of 0.05% CHAPS (in deionized H2O) was added to all wells of the GFB Unifilter plate and allowed soak for 1 h. A wash bu...
Ligand InfoPC cidPC sid
In DepthDetails US Patent
TargetNuclear receptor ROR-gamma(Homo sapiens (Human))
Genentech
US Patent
LigandPNGBDBM197816(BDBM197817 | US9216988, 63)
Affinity DataIC50:  20nMpH: 7.4Assay Description:On day of the assay, 100 uL of 0.05% CHAPS (in deionized H2O) was added to all wells of the GFB Unifilter plate and allowed soak for 1 h. A wash bu...
Ligand InfoPC cidPC sid
In DepthDetails US Patent