BDBM197843 US9216988, 106
SMILES CC(=O)N1CCN(CC1)c1ccc(CN(CC(F)(F)F)S(=O)(=O)C(C)(C)c2ccccc2)c(F)c1
InChI Key InChIKey=AXSVNRQBQXQYTN-UHFFFAOYSA-N
Data  1 IC50
  Tab Delimited (TSV)   2D SDfile   Computed 3D by Vconf -m prep SDfile
Find this compound or compounds like it in BindingDB:
Activity Spreadsheet -- Enzyme Inhibition Constant Data from BindingDB
Found 1 hit for monomerid = 197843
TargetNuclear receptor ROR-gamma(Homo sapiens (Human))
Genentech
US Patent
LigandPNGBDBM197843(US9216988, 106)
Affinity DataIC50:  26nMpH: 7.4Assay Description:On day of the assay, 100 uL of 0.05% CHAPS (in deionized H2O) was added to all wells of the GFB Unifilter plate and allowed soak for 1 h. A wash bu...
Ligand InfoPC cidPC sid
In DepthDetails US Patent