BDBM197935 US9216988, 205
SMILES CC(C)CN(Cc1ccc(N[C@@H]2CC[C@H](CC#N)C2)cc1)S(=O)(=O)Cc1ccccc1
InChI Key InChIKey=QJLXNYRLYZIFBQ-PXDATVDWSA-N
Data  1 IC50
  Tab Delimited (TSV)   2D SDfile   Computed 3D by Vconf -m prep SDfile
Find this compound or compounds like it in BindingDB:
Activity Spreadsheet -- Enzyme Inhibition Constant Data from BindingDB
Found 1 hit for monomerid = 197935
TargetNuclear receptor ROR-gamma(Homo sapiens (Human))
Genentech
US Patent
LigandPNGBDBM197935(US9216988, 205)
Affinity DataIC50:  26nMpH: 7.4Assay Description:On day of the assay, 100 uL of 0.05% CHAPS (in deionized H2O) was added to all wells of the GFB Unifilter plate and allowed soak for 1 h. A wash bu...
Ligand InfoPC cidPC sid
In DepthDetails US Patent