BDBM198121 HPOB
SMILES OCCN(C(=O)Cc1ccc(cc1)C(=O)NO)c1ccccc1
InChI Key InChIKey=RFAZNTABYJYOAR-UHFFFAOYSA-N
Data  1 KI  86 IC50
PDB links: 1 PDB ID matches this monomer.
  Tab Delimited (TSV)   2D SDfile   Computed 3D by Vconf -m prep SDfile
Find this compound or compounds like it in BindingDB:
Activity Spreadsheet -- Enzyme Inhibition Constant Data from BindingDB
Found 86 hits for monomerid = 198121
TargetHistone deacetylase 6 [440-798](Danio rerio)
University of Pennsylvania
LigandPNGBDBM198121(HPOB)
Affinity DataKi:  1nM ΔG°:  -12.3kcal/mole IC50:  1.80nMT: 2°C. Assay description: The fluorescence anisotropy assay was performed with fluorescein-labeled SAHA (fl-SAHA, gift of C. Fierke, University of Michigan) and measured using...
In DepthDetails ArticlePubMed
TargetHistone deacetylase 6(Homo sapiens (Human))
Ghent University
Curated by ChEMBL
LigandPNGBDBM198121(HPOB)
Affinity DataIC50:  56nM. Assay description: Inhibition of human HDAC6 after 15 mins by trypsin-coupled fluorescence assay
In DepthDetails ArticlePubMed
TargetHistone deacetylase 2(Homo sapiens (Human))
Ghent University
Curated by ChEMBL
LigandPNGBDBM198121(HPOB)
Affinity DataIC50:  4.40E+3nM. Assay description: Inhibition of human HDAC2 after 15 mins by trypsin-coupled fluorescence assay
In DepthDetails ArticlePubMed
TargetHistone deacetylase 4(Homo sapiens (Human))
Ghent University
Curated by ChEMBL
LigandPNGBDBM198121(HPOB)
Affinity DataIC50: >1.00E+4nM. Assay description: Inhibition of human HDAC4 after 15 mins by trypsin-coupled fluorescence assay
In DepthDetails ArticlePubMed
TargetHistone deacetylase 5(Homo sapiens (Human))
Ghent University
Curated by ChEMBL
LigandPNGBDBM198121(HPOB)
Affinity DataIC50: >1.00E+4nM. Assay description: Inhibition of human HDAC5 after 15 mins by trypsin-coupled fluorescence assay
In DepthDetails ArticlePubMed
TargetHistone deacetylase 7(Homo sapiens (Human))
Ghent University
Curated by ChEMBL
LigandPNGBDBM198121(HPOB)
Affinity DataIC50: >1.00E+4nM. Assay description: Inhibition of human HDAC7 after 15 mins by trypsin-coupled fluorescence assay
In DepthDetails ArticlePubMed
TargetHistone deacetylase 8(Homo sapiens (Human))
Ghent University
Curated by ChEMBL
LigandPNGBDBM198121(HPOB)
Affinity DataIC50:  2.80E+3nM. Assay description: Inhibition of human HDAC8 after 15 mins by trypsin-coupled fluorescence assay
In DepthDetails ArticlePubMed
TargetHistone deacetylase 9(Homo sapiens (Human))
Ghent University
Curated by ChEMBL
LigandPNGBDBM198121(HPOB)
Affinity DataIC50: >1.00E+4nM. Assay description: Inhibition of human HDAC9 after 15 mins by trypsin-coupled fluorescence assay
In DepthDetails ArticlePubMed
TargetHistone deacetylase 11(Homo sapiens (Human))
Ghent University
Curated by ChEMBL
LigandPNGBDBM198121(HPOB)
Affinity DataIC50: >1.00E+4nM. Assay description: Inhibition of human HDAC11 after 15 mins by trypsin-coupled fluorescence assay
In DepthDetails ArticlePubMed
TargetHistone deacetylase 1(Homo sapiens (Human))
Ghent University
Curated by ChEMBL
LigandPNGBDBM198121(HPOB)
Affinity DataIC50:  2.90E+3nM. Assay description: Inhibition of human HDAC1 after 15 mins by trypsin-coupled fluorescence assay
In DepthDetails ArticlePubMed
TargetHistone deacetylase 3(Homo sapiens (Human))
Ghent University
Curated by ChEMBL
LigandPNGBDBM198121(HPOB)
Affinity DataIC50:  1.70E+3nM. Assay description: Inhibition of human HDAC3 after 15 mins by by trypsin-coupled fluorescence assay
In DepthDetails ArticlePubMed
TargetPolyamine deacetylase HDAC10(Homo sapiens (Human))
Ghent University
Curated by ChEMBL
LigandPNGBDBM198121(HPOB)
Affinity DataIC50:  3.00E+3nM. Assay description: Inhibition of human HDAC10 after 15 mins by trypsin-coupled fluorescence assay
In DepthDetails ArticlePubMed
TargetHistone deacetylase 3(Homo sapiens (Human))
Ghent University
Curated by ChEMBL
LigandPNGBDBM198121(HPOB)
Affinity DataIC50:  1.70E+3nM. Assay description: Inhibition of HDAC3 (unknown origin)
In DepthDetails ArticlePubMed
TargetHistone deacetylase 2(Homo sapiens (Human))
Ghent University
Curated by ChEMBL
LigandPNGBDBM198121(HPOB)
Affinity DataIC50:  4.40E+3nM. Assay description: Inhibition of HDAC2 (unknown origin)
In DepthDetails ArticlePubMed
TargetHistone deacetylase 1(Homo sapiens (Human))
Ghent University
Curated by ChEMBL
LigandPNGBDBM198121(HPOB)
Affinity DataIC50:  2.90E+3nM. Assay description: Inhibition of HDAC1 (unknown origin)
In DepthDetails ArticlePubMed
TargetHistone deacetylase 6(Homo sapiens (Human))
Ghent University
Curated by ChEMBL
LigandPNGBDBM198121(HPOB)
Affinity DataIC50:  56nM. Assay description: Inhibition of HDAC6 (unknown origin)
In DepthDetails ArticlePubMed
TargetPolyamine deacetylase HDAC10(Homo sapiens (Human))
Ghent University
Curated by ChEMBL
LigandPNGBDBM198121(HPOB)
Affinity DataIC50:  79nM. Assay description: Inhibition of tubastatin-Alexa647-tracer binding to recombinant GST-tagged HDAC10 (unknown origin) measured after 1 hr by TR-FRET assay
In DepthDetails ArticlePubMed
TargetPolyamine deacetylase HDAC10(Homo sapiens (Human))
Ghent University
Curated by ChEMBL
LigandPNGBDBM198121(HPOB)
Affinity DataIC50:  316nM. Assay description: Inhibition of dye-labeled tracer binding to HDAC10 (unknown origin) transfected in human HeLa cells measured after 2 hrs by nano-luciferase reporter ...
In DepthDetails ArticlePubMed
TargetHistone deacetylase 3/Nuclear receptor corepressor 2 (HDAC3/NCoR2)(Homo sapiens (Human))
Indian Csir-Central Drug Research Institute
Curated by ChEMBL
LigandPNGBDBM198121(HPOB)
Affinity DataIC50:  1.70E+3nM. Assay description: Inhibition of human recombinant full length C-terminal His-tagged HDAC3 (1 to 428 residues)/N-terminal GST-tagged NCOR2 (395 to 489 residues) express...
In DepthDetails ArticlePubMed
TargetHistone deacetylase 1(Homo sapiens (Human))
Ghent University
Curated by ChEMBL
LigandPNGBDBM198121(HPOB)
Affinity DataIC50:  2.90E+3nM. Assay description: Inhibition of recombinant human FLAG/His-tagged HDAC1 expressed in baculovirus expression system using 7-AMC-labelled HDAC substrate measured after 3...
In DepthDetails ArticlePubMed
TargetHistone deacetylase 5(Homo sapiens (Human))
Ghent University
Curated by ChEMBL
LigandPNGBDBM198121(HPOB)
Affinity DataIC50: >1.00E+4nM. Assay description: Inhibition of recombinant human C-terminal His-tagged HDAC5 (656 to 1122 residues) expressed in baculovirus-infected insect cells using 7-AMC-labelle...
In DepthDetails ArticlePubMed
TargetHistone deacetylase 8(Homo sapiens (Human))
Ghent University
Curated by ChEMBL
LigandPNGBDBM198121(HPOB)
Affinity DataIC50:  2.80E+3nM. Assay description: Inhibition of recombinant full-length human C-terminal HDAC8 expressed in baculovirus infected Sf9 insect cells using 7-AMC-labelled HDAC substrate m...
In DepthDetails ArticlePubMed
TargetHistone deacetylase 11(Homo sapiens (Human))
Ghent University
Curated by ChEMBL
LigandPNGBDBM198121(HPOB)
Affinity DataIC50: >1.00E+4nM. Assay description: Inhibition of recombinant full-length human HDAC11 expressed in baculovirus infected Sf9 insect cells using 7-AMC-labelled HDAC substrate measured af...
In DepthDetails ArticlePubMed
TargetHistone deacetylase 2(Homo sapiens (Human))
Ghent University
Curated by ChEMBL
LigandPNGBDBM198121(HPOB)
Affinity DataIC50:  4.40E+3nM. Assay description: Inhibition of recombinant human full-length HDAC2 expressed in baculovirus expression system using 7-AMC-labelled HDAC substrate measured after 30 mi...
In DepthDetails ArticlePubMed
TargetHistone deacetylase 6(Homo sapiens (Human))
Ghent University
Curated by ChEMBL
LigandPNGBDBM198121(HPOB)
Affinity DataIC50:  58nM. Assay description: Inhibition of recombinant human HDAC6 using 7-AMC-labelled HDAC substrate measured after 30 mins by fluorescence assay
In DepthDetails ArticlePubMed
TargetHistone deacetylase 4(Homo sapiens (Human))
Ghent University
Curated by ChEMBL
LigandPNGBDBM198121(HPOB)
Affinity DataIC50: >1.00E+4nM. Assay description: Inhibition of recombinant human N-terminal GST-tagged/C-terminal His-tagged HDAC4 (627 to 1084 residues) expressed in baculovirus infected Sf21 insec...
In DepthDetails ArticlePubMed
TargetHistone deacetylase 7(Homo sapiens (Human))
Ghent University
Curated by ChEMBL
LigandPNGBDBM198121(HPOB)
Affinity DataIC50: >1.00E+4nM. Assay description: Inhibition of human N-terminal GST-tagged HDAC7 (518 to end residues) expressed in baculovirus infected Sf9 insect cells using 7-AMC-labelled HDAC su...
In DepthDetails ArticlePubMed
TargetHistone deacetylase 9(Homo sapiens (Human))
Ghent University
Curated by ChEMBL
LigandPNGBDBM198121(HPOB)
Affinity DataIC50: >1.00E+4nM. Assay description: Inhibition of recombinant human C-terminal His-tagged HDAC9 (604 to 1066 residues) expressed in baculovirus infected insect cells using 7-AMC-labelle...
In DepthDetails ArticlePubMed
TargetPolyamine deacetylase HDAC10(Homo sapiens (Human))
Ghent University
Curated by ChEMBL
LigandPNGBDBM198121(HPOB)
Affinity DataIC50:  3.00E+3nM. Assay description: Inhibition of recombinant human N-terminal FLAG-tagged HDAC10 (2 to 631 residues) expressed in baculovirus infected using 7-AMC-labelled HDAC substra...
In DepthDetails ArticlePubMed
TargetHistone deacetylase 6(Homo sapiens (Human))
Ghent University
Curated by ChEMBL
LigandPNGBDBM198121(HPOB)
Affinity DataIC50:  56nM. Assay description: Inhibition of human HDAC6 using (Z-(Ac)Lys-AMC) as substrate after 90 mins by fluorescence analysis
In DepthDetails ArticlePubMed
TargetHistone deacetylase 6(Homo sapiens (Human))
Ghent University
Curated by ChEMBL
LigandPNGBDBM198121(HPOB)
Affinity DataIC50:  121nM. Assay description: Inhibition of recombinant full length human N-terminal GST-tagged HDAC6 expressed in baculovirus infected sf9 insect cells pretreated with compound f...
In DepthDetails ArticlePubMed
TargetHistone deacetylase 6(Homo sapiens (Human))
Ghent University
Curated by ChEMBL
LigandPNGBDBM198121(HPOB)
Affinity DataIC50:  121nM. Assay description: Inhibition of recombinant full length human N-terminal GST-tagged HDAC6 expressed in baculovirus infected sf9 insect cells pretreated with compound f...
In DepthDetails ArticlePubMed
TargetHistone deacetylase 8(Homo sapiens (Human))
Ghent University
Curated by ChEMBL
LigandPNGBDBM198121(HPOB)
Affinity DataIC50:  2.80E+3nM. Assay description: Inhibition of HDAC8 (unknown origin)
In DepthDetails ArticlePubMed
TargetHistone deacetylase 1(Homo sapiens (Human))
Ghent University
Curated by ChEMBL
LigandPNGBDBM198121(HPOB)
Affinity DataIC50:  2.90E+3nM. Assay description: Inhibition of HDAC1 (unknown origin)
In DepthDetails ArticlePubMed
TargetHistone deacetylase 6(Homo sapiens (Human))
Ghent University
Curated by ChEMBL
LigandPNGBDBM198121(HPOB)
Affinity DataIC50:  56nM. Assay description: Inhibition of human HDAC6 (unknown origin)
In DepthDetails ArticlePubMed
TargetHistone deacetylase 6(Homo sapiens (Human))
Ghent University
Curated by ChEMBL
LigandPNGBDBM198121(HPOB)
Affinity DataIC50:  56nM. Assay description: Inhibition of human HDAC6 incubated for 30 mins by fluorescence method
In DepthDetails ArticlePubMed
TargetHistone deacetylase 1(Homo sapiens (Human))
Ghent University
Curated by ChEMBL
LigandPNGBDBM198121(HPOB)
Affinity DataIC50:  2.10E+3nM. Assay description: Inhibition of human recombinant HDAC1 using ZMAL (Z-Lys(Ac)-AMC) fluorogenic substrate incubated for 90 mins by fluorescence based assay
In DepthDetails ArticlePubMed
TargetHistone deacetylase 6(Homo sapiens (Human))
Ghent University
Curated by ChEMBL
LigandPNGBDBM198121(HPOB)
Affinity DataIC50:  85nM. Assay description: Inhibition of human recombinant HDAC6 using ZMAL (Z-Lys(Ac)-AMC) fluorogenic substrate incubated for 90 mins by fluorescence based assay
In DepthDetails ArticlePubMed
TargetHistone deacetylase 6(Homo sapiens (Human))
Ghent University
Curated by ChEMBL
LigandPNGBDBM198121(HPOB)
Affinity DataIC50:  56nM. Assay description: Inhibition of HDAC6 (unknown origin)
In DepthDetails ArticlePubMed
TargetHistone deacetylase 1(Homo sapiens (Human))
Ghent University
Curated by ChEMBL
LigandPNGBDBM198121(HPOB)
Affinity DataIC50:  2.90E+3nM. Assay description: Inhibition of HDAC1 (unknown origin)
In DepthDetails ArticlePubMed
TargetHistone deacetylase 2(Homo sapiens (Human))
Ghent University
Curated by ChEMBL
LigandPNGBDBM198121(HPOB)
Affinity DataIC50:  4.40E+3nM. Assay description: Inhibition of HDAC2 (unknown origin)
In DepthDetails ArticlePubMed
TargetHistone deacetylase 3(Homo sapiens (Human))
Ghent University
Curated by ChEMBL
LigandPNGBDBM198121(HPOB)
Affinity DataIC50:  1.70E+3nM. Assay description: Inhibition of HDAC3 (unknown origin)
In DepthDetails ArticlePubMed
TargetHistone deacetylase 4(Homo sapiens (Human))
Ghent University
Curated by ChEMBL
LigandPNGBDBM198121(HPOB)
Affinity DataIC50: >1.00E+4nM. Assay description: Inhibition of HDAC4 (unknown origin)
In DepthDetails ArticlePubMed
TargetHistone deacetylase 5(Homo sapiens (Human))
Ghent University
Curated by ChEMBL
LigandPNGBDBM198121(HPOB)
Affinity DataIC50: >1.00E+4nM. Assay description: Inhibition of HDAC5 (unknown origin)
In DepthDetails ArticlePubMed
TargetHistone deacetylase 6(Homo sapiens (Human))
Ghent University
Curated by ChEMBL
LigandPNGBDBM198121(HPOB)
Affinity DataIC50:  56nM. Assay description: Inhibition of HDAC6 (unknown origin)
In DepthDetails ArticlePubMed
TargetHistone deacetylase 7(Homo sapiens (Human))
Ghent University
Curated by ChEMBL
LigandPNGBDBM198121(HPOB)
Affinity DataIC50: >1.00E+4nM. Assay description: Inhibition of HDAC7 (unknown origin)
In DepthDetails ArticlePubMed
TargetHistone deacetylase 8(Homo sapiens (Human))
Ghent University
Curated by ChEMBL
LigandPNGBDBM198121(HPOB)
Affinity DataIC50:  2.80E+3nM. Assay description: Inhibition of HDAC8 (unknown origin)
In DepthDetails ArticlePubMed
TargetHistone deacetylase 9(Homo sapiens (Human))
Ghent University
Curated by ChEMBL
LigandPNGBDBM198121(HPOB)
Affinity DataIC50: >1.00E+4nM. Assay description: Inhibition of HDAC9 (unknown origin)
In DepthDetails ArticlePubMed
TargetPolyamine deacetylase HDAC10(Homo sapiens (Human))
Ghent University
Curated by ChEMBL
LigandPNGBDBM198121(HPOB)
Affinity DataIC50:  3.00E+3nM. Assay description: Inhibition of HDAC10 (unknown origin)
In DepthDetails ArticlePubMed
TargetHistone deacetylase 11(Homo sapiens (Human))
Ghent University
Curated by ChEMBL
LigandPNGBDBM198121(HPOB)
Affinity DataIC50: >1.00E+4nM. Assay description: Inhibition of HDAC11 (unknown origin)
In DepthDetails ArticlePubMed
Displayed 1 to 50 (of 86 total ) | Next | Last >>